{"text_format":"1","workbook":"xlsx","n_sheets":4,"sheets":["前年度登録","中学生記録会","所属コード","1"],"not_rendered":{"charts":0,"images":0,"macros":1,"external_links":0,"defined_names":8,"comments":0,"pivot_tables":0},"unopened":[],"bounds":{"document_bytes":16777216,"sheet_cells":100000,"rows_first":2000,"rows_last":500,"rows_between":2000,"halvings":0,"cell_chars":16384,"cell_head_chars":4096},"cells_cut":0,"cells_raw":0,"read":"whole","date_system":"1900"}

{"sheet":"前年度登録","index":0,"n_rows":191,"n_cols":116,"rows_kept":191,"cut":false,"hidden":false,"merged":[[0,0,2,14],[0,48,0,54],[1,32,1,34],[0,15,0,17],[0,18,0,19],[0,23,0,26],[1,17,2,17],[1,18,1,19],[1,20,2,20],[1,23,2,23],[1,24,2,24],[1,25,1,27]]}
["JAAF登録サイトより貼り付け",null,null,null,null,null,null,null,null,null,null,null,null,null,null,"顧問名",null,null,null,null,"学校名",null,"緊急連絡先（携帯）",null,null,null,null,null,null,null,null,null,null,null,null,null,null,null,null,null,null,null,null,null,null,null,null,"男","左記、白枠は必ず入れて下さい",null,null,null,null,null,null,null,null,null,null,null,null,null,null,null,null,null,null,null,null,null,null,null,null,null,null,null,null,null,null,null,null,null,null,null,null,null,null,null,null,null,null,null,null,null,null,null,null,null,null,null,null,null,null,null,null,null,null,null,null,null,null,null,null,null,null,"去年の登録を貼り付けてください"]
[null,null,null,null,null,null,null,null,null,null,null,null,null,null,null,null,"登録月日","学校コード","登録番号",null,"登録の種類","氏名","フリガナ","学年","性別","生年月日",null,null,null,"所属","学校番号","所属地コード",null,null,null,null,null,null,null,null,null,null,null,null,null,null,null,"女","公認記録記載欄(随時記録が更新された場合は、変更入力して下さい。全ての申し込みに反映されます。正確にお願いいたします",null,null,null,null,null,null,null,null,null,null,null,null,null,null,null,"高跳の記録",null,null,null,null,null,null,null,null,null,null,null,null,null,null,null,null,null,null,null,null,null,null,null,null,null,null,null,null,null,null,null,null,null,null,null,null,null,null,null,null,null,null,null,null,null,null,null,null,null,null,"学年は1つ上げてください"]
[null,null,null,null,null,null,null,null,null,null,null,null,null,null,null,null,"(○／○○）",null,"日本陸連ID","選手番号",null,"（姓と名の間は全角１文字スペース）","（全角カタカナで入力、姓と名の間は全角１文字スペース）",null,null,"年（西暦）","月","日",null,"三重",null,"三重",null,null,null,null,null,null,null,null,null,null,null,null,null,null,null,null,"100m","200m","400m","800m","1500m","2000m","3000m","110mH","100mH","走高跳","棒高跳","走幅跳","三段跳","砲丸投","円盤投","ｼﾞｬﾍﾞﾘｯｸ","四種","110mJH","少年B110mJH","少年B100mYH","100mYH","2年100m","2年1500m","1年100m","1年1500m","1年800m","A-100m","A-200m","A-3000m","A-110mH","A-走高跳","A-砲丸投","AB円盤投","ABCｼﾞｬﾍﾞﾘｯｸ","A-100mH","B-100m","B-1500m","B-110mH","B-走幅跳","B-100mH","C-800m","B-砲丸投","C-100m","C-1500m",null,"C-走幅跳",null,"中学女子3ｋ","中学女子3ｋ","中学男子5ｋ","少年B砲丸投","TRIM","数","空","名","姓","名"]
["JAAF ID","会員名","会員名カナ","性別","登録都道府県コード","登録都道府県名","団体ID","団体名","団体名カナ","団体名略称","生年月日","都道府県(学連)登録番号","旧団体コード","備考","学年",1,null,null,null,null,null,null,null,null,null,null,null,null,{"$f":"DJ4","v":"00"},{"$f":"V1","v":0},{"$f":"IF(AD4=\"\",\"\",VLOOKUP(AD4,所属コード!$A$2:$E$247,2,FALSE))","v":{"$error":"#N/A"}},{"$f":"IF(AD4=\"\",\"\",VLOOKUP(AD4,所属コード!$A$2:$G$189,7,FALSE))","v":{"$error":"#N/A"}},null,null,null,null,null,null,null,{"$f":"IF(Y4=\"\",\"\",IF(Y4=\"男\",1,2))","v":""},{"$f":"ASC(W4)","v":""},"男",null,null,null,null,null,null,null,null,null,null,null,null,null,null,null,null,null,null,null,null,null,null,{"$f":"BF4","v":0},{"$f":"BD4","v":0},{"$f":"BD4","v":0},{"$f":"BD4","v":0},0,{"$f":"AW4","v":0},{"$f":"BA4","v":0},{"$f":"AW4","v":0},{"$f":"BA4","v":0},{"$f":"AZ4","v":0},{"$f":"AW4","v":0},{"$f":"AX4","v":0},{"$f":"BC4","v":0},{"$f":"BD4","v":0},{"$f":"BF4","v":0},{"$f":"BJ4","v":0},{"$f":"BK4","v":0},{"$f":"BL4","v":0},{"$f":"BE4","v":0},{"$f":"AW4","v":0},{"$f":"BA4","v":0},{"$f":"BD4","v":0},{"$f":"BH4","v":0},{"$f":"BE4","v":0},{"$f":"AZ4","v":0},{"$f":"BJ4","v":0},{"$f":"AW4","v":0},{"$f":"BA4","v":0},{"$f":"BE4","v":0},{"$f":"BH4","v":0},{"$f":"BJ4","v":0},{"$f":"BC4","v":0},{"$f":"BB4","v":0},{"$f":"BC4","v":0},{"$f":"BJ4","v":0},{"$f":"TRIM(V4)","v":""},{"$f":"IF(CV4=\"\",\"\",LEN(CV4))","v":""},{"$f":"IF(CV4=\"\",\"\",FIND(\"　\",CV4,1))","v":""},{"$f":"IF(CV4=\"\",\"\",CW4-CX4)","v":""},{"$f":"IF(CV4=\"\",\"\",LEFT(CV4,CX4-1))","v":""},{"$f":"IF(CV4=\"\",\"\",RIGHT(CV4,CY4))","v":""},{"$f":"IF(CV4=\"\",\"\",IF(CW4=4,CONCATENATE(CZ4,\"　\",\"　\",DA4),IF(CW4=6,CONCATENATE(CZ4,DA4),CV4)))","v":""},{"$f":"IF(X4=\"3\",3,IF(X4=\"2\",2,IF(X4=\"1\",1,IF(X4=1,1,IF(X4=2,2,IF(X4=3,3,\"\"))))))","v":""},{"$f":"IF(AB4<10,CONCATENATE(0,AB4),AB4)","v":"0"},{"$f":"Z4","v":0},"成徳",235001,{"$f":"IF(AA4=1,\"01\",IF(AA4=2,\"02\",IF(AA4=3,\"03\",IF(AA4=4,\"04\",IF(AA4=5,\"05\",IF(AA4=6,\"06\",IF(AA4=7,\"07\",IF(AA4=8,\"08\",IF(AA4=9,\"09\",AA4)))))))))","v":0},{"$f":"IF(AB4=1,\"01\",IF(AB4=2,\"02\",IF(AB4=3,\"03\",IF(AB4=4,\"04\",IF(AB4=5,\"05\",IF(AB4=6,\"06\",IF(AB4=7,\"07\",IF(AB4=8,\"08\",IF(AB4=9,\"09\",AB4)))))))))","v":0},{"$f":"CONCATENATE(DH4,DI4)","v":"00"}]
[null,null,null,null,null,null,null,null,null,null,null,null,null,null,null,2,null,null,null,null,null,null,null,null,null,null,null,null,{"$f":"DJ5","v":"00"},{"$f":"IF(V5=\"\",\"\",$AD$4)","v":""},{"$f":"IF(V5=\"\",\"\",$AE$4)","v":""},{"$f":"IF(V5=\"\",\"\",$AF$4)","v":""},null,null,null,null,null,null,null,{"$f":"IF(Y5=\"\",\"\",IF(Y5=\"男\",1,2))","v":""},{"$f":"ASC(W5)","v":""},"女",null,null,null,null,null,null,null,null,null,null,null,null,null,null,null,null,null,null,null,null,null,null,{"$f":"BF5","v":0},0,0,0,0,{"$f":"AW5","v":0},{"$f":"BA5","v":0},{"$f":"AW5","v":0},{"$f":"BA5","v":0},{"$f":"AZ5","v":0},{"$f":"AW5","v":0},0,{"$f":"BC5","v":0},0,{"$f":"BF5","v":0},{"$f":"BJ5","v":0},0,0,{"$f":"BE5","v":0},{"$f":"AW5","v":0},{"$f":"BA5","v":0},{"$f":"BD5","v":0},{"$f":"BH5","v":0},{"$f":"BE5","v":0},{"$f":"AZ5","v":0},{"$f":"BJ5","v":0},{"$f":"AW5","v":0},{"$f":"BA5","v":0},{"$f":"BE5","v":0},{"$f":"BH5","v":0},{"$f":"BJ5","v":0},{"$f":"BC5","v":0},{"$f":"BB5","v":0},0,{"$f":"BJ5","v":0},{"$f":"TRIM(V5)","v":""},{"$f":"IF(CV5=\"\",\"\",LEN(CV5))","v":""},{"$f":"IF(CV5=\"\",\"\",FIND(\"　\",CV5,1))","v":""},{"$f":"IF(CV5=\"\",\"\",CW5-CX5)","v":""},{"$f":"IF(CV5=\"\",\"\",LEFT(CV5,CX5-1))","v":""},{"$f":"IF(CV5=\"\",\"\",RIGHT(CV5,CY5))","v":""},{"$f":"IF(CV5=\"\",\"\",IF(CW5=4,CONCATENATE(CZ5,\"　\",\"　\",DA5),IF(CW5=6,CONCATENATE(CZ5,DA5),CV5)))","v":""},"",{"$f":"IF(AB5<10,CONCATENATE(0,AB5),AB5)","v":"0"},{"$f":"Z5","v":0},"明正",235002,{"$f":"IF(AA5=1,\"01\",IF(AA5=2,\"02\",IF(AA5=3,\"03\",IF(AA5=4,\"04\",IF(AA5=5,\"05\",IF(AA5=6,\"06\",IF(AA5=7,\"07\",IF(AA5=8,\"08\",IF(AA5=9,\"09\",AA5)))))))))","v":0},{"$f":"IF(AB5=1,\"01\",IF(AB5=2,\"02\",IF(AB5=3,\"03\",IF(AB5=4,\"04\",IF(AB5=5,\"05\",IF(AB5=6,\"06\",IF(AB5=7,\"07\",IF(AB5=8,\"08\",IF(AB5=9,\"09\",AB5)))))))))","v":0},{"$f":"CONCATENATE(DH5,DI5)","v":"00"}]
[null,null,null,null,null,null,null,null,null,null,null,null,null,null,null,3,null,null,null,null,null,null,null,null,null,null,null,null,"00",{"$f":"IF(V6=\"\",\"\",$AD$4)","v":""},{"$f":"IF(AD6=\"\",\"\",VLOOKUP(AD6,所属コード!$A$2:$E$189,2,FALSE))","v":""},{"$f":"IF(AD6=\"\",\"\",VLOOKUP(AD6,所属コード!$A$2:$G$189,7,FALSE))","v":""},null,null,null,null,null,null,null,"","","23",null,null,null,null,null,null,null,null,null,null,null,null,null,null,null,null,null,null,null,null,null,null,0,0,0,0,0,0,0,0,0,0,0,0,0,0,0,0,0,0,0,0,0,0,0,0,0,0,0,0,0,0,0,0,0,0,0,"","","","","","","","","0",0,"光風",235003,0,0,"00"]
[null,null,null,null,null,null,null,null,null,null,null,null,null,null,null,4,null,null,null,null,null,null,null,null,null,null,null,null,"00","",{"$f":"IF(AD7=\"\",\"\",VLOOKUP(AD7,所属コード!$A$2:$E$189,2,FALSE))","v":""},{"$f":"IF(AD7=\"\",\"\",VLOOKUP(AD7,所属コード!$A$2:$G$189,7,FALSE))","v":""},null,null,null,null,null,null,null,"","",null,null,null,null,null,null,null,null,null,null,null,null,null,null,null,null,null,null,null,null,null,null,null,0,0,0,0,0,0,0,0,0,0,0,0,0,0,0,0,0,0,0,0,0,0,0,0,0,0,0,0,0,0,0,0,0,0,0,"","","","","","","","","0",0,"陽和",235004,0,0,"00"]
[null,null,null,null,null,null,null,null,null,null,null,null,null,null,null,5,null,null,null,null,null,null,null,null,null,null,null,null,"00","",{"$f":"IF(AD8=\"\",\"\",VLOOKUP(AD8,所属コード!$A$2:$E$189,2,FALSE))","v":""},{"$f":"IF(AD8=\"\",\"\",VLOOKUP(AD8,所属コード!$A$2:$G$189,7,FALSE))","v":""},null,null,null,null,null,null,null,"","",null,null,null,null,null,null,null,null,null,null,null,null,null,null,null,null,null,null,null,null,null,null,null,0,0,0,0,0,0,0,0,0,0,0,0,0,0,0,0,0,0,0,0,0,0,0,0,0,0,0,0,0,0,0,0,0,0,0,"","","","","","","","","0",0,"正和",235005,0,0,"00"]
[null,null,null,null,null,null,null,null,null,null,null,null,null,null,null,6,null,null,null,null,null,null,null,null,null,null,null,null,"00","",{"$f":"IF(AD9=\"\",\"\",VLOOKUP(AD9,所属コード!$A$2:$E$189,2,FALSE))","v":""},{"$f":"IF(AD9=\"\",\"\",VLOOKUP(AD9,所属コード!$A$2:$G$189,7,FALSE))","v":""},null,null,null,null,null,null,null,"","",null,null,null,null,null,null,null,null,null,null,null,null,null,null,null,null,null,null,null,null,null,null,null,0,0,0,0,0,0,0,0,0,0,0,0,0,0,0,0,0,0,0,0,0,0,0,0,0,0,0,0,0,0,0,0,0,0,0,"","","","","","","","","0",0,"陵成",235006,0,0,"00"]
[null,null,null,null,null,null,null,null,null,null,null,null,null,null,null,7,null,null,null,null,null,null,null,null,null,null,null,null,"00","",{"$f":"IF(AD10=\"\",\"\",VLOOKUP(AD10,所属コード!$A$2:$E$189,2,FALSE))","v":""},{"$f":"IF(AD10=\"\",\"\",VLOOKUP(AD10,所属コード!$A$2:$G$189,7,FALSE))","v":""},null,null,null,null,null,null,null,"","",null,null,null,null,null,null,null,null,null,null,null,null,null,null,null,null,null,null,null,null,null,null,null,0,0,0,0,0,0,0,0,0,0,0,0,0,0,0,0,0,0,0,0,0,0,0,0,0,0,0,0,0,0,0,0,0,0,0,"","","","","","","","","0",0,"光陵",235007,0,0,"00"]
[null,null,null,null,null,null,null,null,null,null,null,null,null,null,null,8,null,null,null,null,null,null,null,null,null,null,null,null,"00","",{"$f":"IF(AD11=\"\",\"\",VLOOKUP(AD11,所属コード!$A$2:$E$189,2,FALSE))","v":""},{"$f":"IF(AD11=\"\",\"\",VLOOKUP(AD11,所属コード!$A$2:$G$189,7,FALSE))","v":""},null,null,null,null,null,null,null,"","",null,null,null,null,null,null,null,null,null,null,null,null,null,null,null,null,null,null,null,null,null,null,null,0,0,0,0,0,0,0,0,0,0,0,0,0,0,0,0,0,0,0,0,0,0,0,0,0,0,0,0,0,0,0,0,0,0,0,"","","","","","","","","0",0,"多度",235008,0,0,"00"]
[null,null,null,null,null,null,null,null,null,null,null,null,null,null,null,9,null,null,null,null,null,null,null,null,null,null,null,null,"00","",{"$f":"IF(AD12=\"\",\"\",VLOOKUP(AD12,所属コード!$A$2:$E$189,2,FALSE))","v":""},{"$f":"IF(AD12=\"\",\"\",VLOOKUP(AD12,所属コード!$A$2:$G$189,7,FALSE))","v":""},null,null,null,null,null,null,null,"","",null,null,null,null,null,null,null,null,null,null,null,null,null,null,null,null,null,null,null,null,null,null,null,0,0,0,0,0,0,0,0,0,0,0,0,0,0,0,0,0,0,0,0,0,0,0,0,0,0,0,0,0,0,0,0,0,0,0,"","","","","","","","","0",0,"長島",235009,0,0,"00"]
[null,null,null,null,null,null,null,null,null,null,null,null,null,null,null,10,null,null,null,null,null,null,null,null,null,null,null,null,"00","",{"$f":"IF(AD13=\"\",\"\",VLOOKUP(AD13,所属コード!$A$2:$E$189,2,FALSE))","v":""},{"$f":"IF(AD13=\"\",\"\",VLOOKUP(AD13,所属コード!$A$2:$G$189,7,FALSE))","v":""},null,null,null,null,null,null,null,"","",null,null,null,null,null,null,null,null,null,null,null,null,null,null,null,null,null,null,null,null,null,null,null,0,0,0,0,0,0,0,0,0,0,0,0,0,0,0,0,0,0,0,0,0,0,0,0,0,0,0,0,0,0,0,0,0,0,0,"","","","","","","","","0",0,"津田学園",235010,0,0,"00"]
[null,null,null,null,null,null,null,null,null,null,null,null,null,null,null,11,null,null,null,null,null,null,null,null,null,null,null,null,"00","",{"$f":"IF(AD14=\"\",\"\",VLOOKUP(AD14,所属コード!$A$2:$E$189,2,FALSE))","v":""},{"$f":"IF(AD14=\"\",\"\",VLOOKUP(AD14,所属コード!$A$2:$G$189,7,FALSE))","v":""},null,null,null,null,null,null,null,"","",null,null,null,null,null,null,null,null,null,null,null,null,null,null,null,null,null,null,null,null,null,null,null,0,0,0,0,0,0,0,0,0,0,0,0,0,0,0,0,0,0,0,0,0,0,0,0,0,0,0,0,0,0,0,0,0,0,0,"","","","","","","","","0",0,"木曽岬",235011,0,0,"00"]
[null,null,null,null,null,null,null,null,null,null,null,null,null,null,null,12,null,null,null,null,null,null,null,null,null,null,null,null,"00","",{"$f":"IF(AD15=\"\",\"\",VLOOKUP(AD15,所属コード!$A$2:$E$189,2,FALSE))","v":""},{"$f":"IF(AD15=\"\",\"\",VLOOKUP(AD15,所属コード!$A$2:$G$189,7,FALSE))","v":""},null,null,null,null,null,null,null,"","",null,null,null,null,null,null,null,null,null,null,null,null,null,null,null,null,null,null,null,null,null,null,null,0,0,0,0,0,0,0,0,0,0,0,0,0,0,0,0,0,0,0,0,0,0,0,0,0,0,0,0,0,0,0,0,0,0,0,"","","","","","","","","0",0,"北勢",235012,0,0,"00"]
{"$rows_left_out":177}
{"sheet":"中学生記録会","index":1,"n_rows":117,"n_cols":58,"rows_kept":117,"cut":false,"hidden":false,"merged":[[37,50,37,51],[38,50,38,51],[45,50,45,51],[46,50,46,51],[4,19,4,24],[16,38,16,39],[17,38,17,39],[5,38,5,40],[7,38,7,39],[12,38,12,39],[6,38,6,40],[11,38,11,40],[5,50,5,51],[43,38,43,39],[30,50,30,51],[30,38,30,39],[5,52,5,53],[6,50,6,51],[6,52,6,53],[14,50,14,51],[13,50,13,51],[13,52,13,53],[14,52,14,53],[30,52,30,53],[21,50,21,51],[21,52,21,53],[22,50,22,51],[22,52,22,53],[29,50,29,51],[29,52,29,53]]}
[null,null,null,null,"所属名",{"$f":"IF(前年度登録!$AD$4=\"\",\"\",前年度登録!$AD$4)","v":0}]
[null,null,null,null,"所属コード",{"$f":"前年度登録!$AE$4","v":{"$error":"#N/A"}},"中学生記録会"]
[null,null,null,null,"顧問名",{"$f":"IF(前年度登録!$S$1=\"\",\"\",前年度登録!$S$1)","v":""},"男子",null,null,null,null,null,null,null,{"$f":"COUNTIF($I$7:$I$116,1)-COUNTIF($AW$7:$AW$116,0)","v":0}]
[null,null,null,null,"顧問連絡先",{"$f":"IF(前年度登録!$X$1=\"\",\"\",前年度登録!$X$1)","v":""},"女子",null,null,null,null,null,null,null,{"$f":"COUNTIF($I$7:$I$116,2)-COUNTIF($AX$7:$AX$116,0)","v":0},null,{"$f":"O3+O4","v":0}]
[null,null,null,null,null,null,"大会参加費",null,null,null,null,null,null,null,{"$f":"(AN30+AN42)*500+($AQ$48*1000)","v":0},null,null,null,null,"リレー2種目は　　　　　　　出場できません"]
["競技者コード","所属コード","所属コードB","ナンバーA","ナンバー","名　前","カナ名","掲示板名","性別","学年","生年","月日","個人所属地コード","陸連ID","1種目","コード","記録",null,null,"2種目","コード","記録",null,null,"4×100R","コード","記録3","種目4","コード","自己記録4","種目5","コード","自己記録5",null,null,null,100,null,"4×100mＲ",null,null,null,null,null,null,null,null,"種目数","男子","女子","男子4×100mR",null,"女子4×100mR"]
[{"$f":"Y7","v":0},{"$f":"前年度登録!AE4","v":{"$error":"#N/A"}},{"$f":"Y7","v":0},null,{"$f":"前年度登録!T4","v":0},{"$f":"前年度登録!DB4","v":""},{"$f":"前年度登録!AO4","v":""},{"$f":"前年度登録!DB4","v":""},{"$f":"前年度登録!AN4","v":""},{"$f":"前年度登録!DC4","v":""},{"$f":"前年度登録!DE4","v":0},{"$f":"前年度登録!DJ4","v":"00"},"三重",{"$f":"前年度登録!S4","v":0},null,{"$f":"IF(O7=\"\",\"\",IF(I7=1,VLOOKUP(O7,$AM$19:$AO$29,3,FALSE),IF(I7=2,VLOOKUP(O7,$AM$32:$AO$41,3,FALSE))))","v":""},{"$f":"IF(O7=\"\",\"\",HLOOKUP(O7,前年度登録!$AW$3:$CW$118,2,FALSE))","v":""},{"$f":"IF(O7=\"\",\"\",0)","v":""},{"$f":"IF(O7=\"\",\"\",2)","v":""},null,{"$f":"IF(T7=\"\",\"\",IF(I7=1,VLOOKUP(T7,$AM$19:$AO$29,3,FALSE),IF(I7=2,VLOOKUP(T7,$AM$32:$AO$41,3,FALSE))))","v":""},null,{"$f":"IF(T7=\"\",\"\",0)","v":""},{"$f":"IF(T7=\"\",\"\",2)","v":""},null,{"$f":"IF(Y7=\"\",\"\",IF(I7=1,VLOOKUP(Y7,$AM$48:$AN$50,2,FALSE),IF(I7=2,VLOOKUP(Y7,$AM$51:$AN$53,2,FALSE))))","v":""},null,null,{"$f":"IF(AB7=\"\",\"\",IF(I7=1,VLOOKUP(AB7,#REF!,2,FALSE),IF(I7=2,VLOOKUP(AB7,#REF!,2,FALSE))))","v":""},null,null,null,null,null,null,null,1500,{"$f":"IF(O7=\"\",\"\",1)","v":""},"男子",null,null,null,null,null,null,{"$f":"IF(OR(AL7=1,T7=\"\"),0,1)","v":0},null,{"$f":"COUNT(P7,U7,Z7)","v":0},{"$f":"IF(I7=1,AV7,\"\")","v":""},{"$f":"IF(I7=2,AV7,\"\")","v":""},"Ａ",null,"Ａ"]
[0,{"$f":"前年度登録!AE5","v":""},{"$f":"Y8","v":0},null,{"$f":"前年度登録!T5","v":0},{"$f":"前年度登録!DB5","v":""},{"$f":"前年度登録!AO5","v":""},{"$f":"前年度登録!DB5","v":""},{"$f":"前年度登録!AN5","v":""},{"$f":"前年度登録!DC5","v":""},{"$f":"前年度登録!DE5","v":0},{"$f":"前年度登録!DJ5","v":"00"},"三重",{"$f":"前年度登録!S5","v":0},null,{"$f":"IF(O8=\"\",\"\",IF(I8=1,VLOOKUP(O8,$AM$19:$AO$29,3,FALSE),IF(I8=2,VLOOKUP(O8,$AM$32:$AO$41,3,FALSE))))","v":""},{"$f":"IF(O8=\"\",\"\",HLOOKUP(O8,前年度登録!$AW$3:$CW$118,3,FALSE))","v":""},{"$f":"IF(O8=\"\",\"\",0)","v":""},{"$f":"IF(O8=\"\",\"\",2)","v":""},null,{"$f":"IF(T8=\"\",\"\",IF(I8=1,VLOOKUP(T8,$AM$19:$AO$29,3,FALSE),IF(I8=2,VLOOKUP(T8,$AM$32:$AO$41,3,FALSE))))","v":""},null,{"$f":"IF(T8=\"\",\"\",0)","v":""},{"$f":"IF(T8=\"\",\"\",2)","v":""},null,{"$f":"IF(Y8=\"\",\"\",IF(I8=1,VLOOKUP(Y8,$AM$48:$AN$50,2,FALSE),IF(I8=2,VLOOKUP(Y8,$AM$51:$AN$53,2,FALSE))))","v":""},null,null,{"$f":"IF(AB8=\"\",\"\",IF(I8=1,VLOOKUP(AB8,#REF!,2,FALSE),IF(I8=2,VLOOKUP(AB8,#REF!,2,FALSE))))","v":""},null,null,null,null,null,null,null,"*",{"$f":"IF(O8=\"\",\"\",1)","v":""},"リレー記録記載欄",null,"オーダー",null,null,null,null,0,null,{"$f":"COUNT(P8,U8,Z8)","v":0},"","",{"$f":"IF(ISERROR(BC8),\"\",BC8)","v":""},{"$f":"IF(ISERROR(BD8),\"\",BD8)","v":""},{"$f":"IF(ISERROR(BE8),\"\",BE8)","v":""},{"$f":"IF(ISERROR(BF8),\"\",BF8)","v":""},{"$f":"VLookUpX(\"男子A\",$A$7:$F$116,1,5)","v":{"$error":"#N/A"}},{"$f":"VLookUpX(\"男子A\",$A$7:$F$116,1,6)","v":{"$error":"#N/A"}},{"$f":"VLookUpX(\"女子A\",$A$7:$F$116,1,5)","v":{"$error":"#N/A"}},{"$f":"VLookUpX(\"女子A\",$A$7:$F$116,1,6)","v":{"$error":"#N/A"}}]
[0,{"$f":"前年度登録!AE6","v":""},0,null,{"$f":"前年度登録!T6","v":0},{"$f":"前年度登録!DB6","v":""},{"$f":"前年度登録!AO6","v":""},{"$f":"前年度登録!DB6","v":""},{"$f":"前年度登録!AN6","v":""},{"$f":"前年度登録!DC6","v":""},{"$f":"前年度登録!DE6","v":0},{"$f":"前年度登録!DJ6","v":"00"},"三重",{"$f":"前年度登録!S6","v":0},null,"",{"$f":"IF(O9=\"\",\"\",HLOOKUP(O9,前年度登録!$AW$3:$CW$118,4,FALSE))","v":""},"","",null,"",null,"","",null,"",null,null,{"$f":"IF(AB9=\"\",\"\",IF(I9=1,VLOOKUP(AB9,#REF!,2,FALSE),IF(I9=2,VLOOKUP(AB9,#REF!,2,FALSE))))","v":""},null,null,null,null,null,null,null,"走幅跳","","A",null,{"$f":"COUNTIF($Y$7:$Y$116,\"男子A\")","v":0},{"$f":"IF(AO9>0,1,0)","v":0},null,null,null,0,null,0,"","",{"$f":"IF(ISERROR(BC9),\"\",BC9)","v":""},"",{"$f":"IF(ISERROR(BE9),\"\",BE9)","v":""},"",{"$f":"VLookUpX(\"男子A\",$A$7:$F$116,2,5)","v":{"$error":"#N/A"}},{"$f":"VLookUpX(\"男子A\",$A$7:$F$116,2,6)","v":{"$error":"#N/A"}},{"$f":"VLookUpX(\"女子A\",$A$7:$F$116,2,5)","v":{"$error":"#N/A"}},{"$f":"VLookUpX(\"女子A\",$A$7:$F$116,2,6)","v":{"$error":"#N/A"}}]
[0,{"$f":"前年度登録!AE7","v":""},0,null,{"$f":"前年度登録!T7","v":0},{"$f":"前年度登録!DB7","v":""},{"$f":"前年度登録!AO7","v":""},{"$f":"前年度登録!DB7","v":""},{"$f":"前年度登録!AN7","v":""},{"$f":"前年度登録!DC7","v":""},{"$f":"前年度登録!DE7","v":0},{"$f":"前年度登録!DJ7","v":"00"},"三重",{"$f":"前年度登録!S7","v":0},null,"",{"$f":"IF(O10=\"\",\"\",HLOOKUP(O10,前年度登録!$AW$3:$CW$118,5,FALSE))","v":""},"","",null,"",null,"","",null,"",null,null,{"$f":"IF(AB10=\"\",\"\",IF(I10=1,VLOOKUP(AB10,#REF!,2,FALSE),IF(I10=2,VLOOKUP(AB10,#REF!,2,FALSE))))","v":""},null,null,null,null,null,null,null,"砲丸投","","B",null,{"$f":"COUNTIF($Y$7:$Y$116,\"男子B\")","v":0},{"$f":"IF(AO10>0,1,0)","v":0},null,null,null,0,null,0,"","","","","","",{"$f":"VLookUpX(\"男子A\",$A$7:$F$116,3,5)","v":{"$error":"#N/A"}},{"$f":"VLookUpX(\"男子A\",$A$7:$F$116,3,6)","v":{"$error":"#N/A"}},{"$f":"VLookUpX(\"女子A\",$A$7:$F$116,3,5)","v":{"$error":"#N/A"}},{"$f":"VLookUpX(\"女子A\",$A$7:$F$116,3,6)","v":{"$error":"#N/A"}}]
[0,{"$f":"前年度登録!AE8","v":""},0,null,{"$f":"前年度登録!T8","v":0},{"$f":"前年度登録!DB8","v":""},{"$f":"前年度登録!AO8","v":""},{"$f":"前年度登録!DB8","v":""},{"$f":"前年度登録!AN8","v":""},{"$f":"前年度登録!DC8","v":""},{"$f":"前年度登録!DE8","v":0},{"$f":"前年度登録!DJ8","v":"00"},"三重",{"$f":"前年度登録!S8","v":0},null,"",{"$f":"IF(O11=\"\",\"\",HLOOKUP(O11,前年度登録!$AW$3:$CW$118,6,FALSE))","v":""},"","",null,"",null,"","",null,"",null,null,{"$f":"IF(AB11=\"\",\"\",IF(I11=1,VLOOKUP(AB11,#REF!,2,FALSE),IF(I11=2,VLOOKUP(AB11,#REF!,2,FALSE))))","v":""},null,null,null,null,null,null,null,"ｼﾞｬﾍﾞﾘｯｸ","","C",null,{"$f":"COUNTIF($Y$7:$Y$116,\"男子C\")","v":0},0,{"$f":"SUM(AP9:AP11)","v":0},null,null,0,null,0,"","","","","","",{"$f":"VLookUpX(\"男子A\",$A$7:$F$116,4,5)","v":{"$error":"#N/A"}},{"$f":"VLookUpX(\"男子A\",$A$7:$F$116,4,6)","v":{"$error":"#N/A"}},{"$f":"VLookUpX(\"女子A\",$A$7:$F$116,4,5)","v":{"$error":"#N/A"}},{"$f":"VLookUpX(\"女子A\",$A$7:$F$116,4,6)","v":{"$error":"#N/A"}}]
[0,{"$f":"前年度登録!AE9","v":""},0,null,{"$f":"前年度登録!T9","v":0},{"$f":"前年度登録!DB9","v":""},{"$f":"前年度登録!AO9","v":""},{"$f":"前年度登録!DB9","v":""},{"$f":"前年度登録!AN9","v":""},{"$f":"前年度登録!DC9","v":""},{"$f":"前年度登録!DE9","v":0},{"$f":"前年度登録!DJ9","v":"00"},"三重",{"$f":"前年度登録!S9","v":0},null,"",{"$f":"IF(O12=\"\",\"\",HLOOKUP(O12,前年度登録!$AW$3:$CW$118,7,FALSE))","v":""},"","",null,"",null,"","",null,"",null,null,{"$f":"IF(AB12=\"\",\"\",IF(I12=1,VLOOKUP(AB12,#REF!,2,FALSE),IF(I12=2,VLOOKUP(AB12,#REF!,2,FALSE))))","v":""},null,null,null,null,null,null,null,100,"","女子",null,null,null,null,null,null,0,null,0,"","","","","","",{"$f":"VLookUpX(\"男子A\",$A$7:$F$116,5,5)","v":{"$error":"#N/A"}},{"$f":"VLookUpX(\"男子A\",$A$7:$F$116,5,6)","v":{"$error":"#N/A"}},{"$f":"VLookUpX(\"女子A\",$A$7:$F$116,5,5)","v":{"$error":"#N/A"}},{"$f":"VLookUpX(\"女子A\",$A$7:$F$116,5,6)","v":{"$error":"#N/A"}}]
[0,{"$f":"前年度登録!AE10","v":""},0,null,{"$f":"前年度登録!T10","v":0},{"$f":"前年度登録!DB10","v":""},{"$f":"前年度登録!AO10","v":""},{"$f":"前年度登録!DB10","v":""},{"$f":"前年度登録!AN10","v":""},{"$f":"前年度登録!DC10","v":""},{"$f":"前年度登録!DE10","v":0},{"$f":"前年度登録!DJ10","v":"00"},"三重",{"$f":"前年度登録!S10","v":0},null,"",{"$f":"IF(O13=\"\",\"\",HLOOKUP(O13,前年度登録!$AW$3:$CW$118,8,FALSE))","v":""},"","",null,"",null,"","",null,"",null,null,{"$f":"IF(AB13=\"\",\"\",IF(I13=1,VLOOKUP(AB13,#REF!,2,FALSE),IF(I13=2,VLOOKUP(AB13,#REF!,2,FALSE))))","v":""},null,null,null,null,null,null,null,800,"","リレー記録記載欄",null,"オーダー",null,null,null,null,0,null,0,"","","","","","",{"$f":"VLookUpX(\"男子A\",$A$7:$F$116,6,5)","v":{"$error":"#N/A"}},{"$f":"VLookUpX(\"男子A\",$A$7:$F$116,6,6)","v":{"$error":"#N/A"}},{"$f":"VLookUpX(\"女子A\",$A$7:$F$116,6,5)","v":{"$error":"#N/A"}},{"$f":"VLookUpX(\"女子A\",$A$7:$F$116,6,6)","v":{"$error":"#N/A"}}]
[0,{"$f":"前年度登録!AE11","v":""},0,null,{"$f":"前年度登録!T11","v":0},{"$f":"前年度登録!DB11","v":""},{"$f":"前年度登録!AO11","v":""},{"$f":"前年度登録!DB11","v":""},{"$f":"前年度登録!AN11","v":""},{"$f":"前年度登録!DC11","v":""},{"$f":"前年度登録!DE11","v":0},{"$f":"前年度登録!DJ11","v":"00"},"三重",{"$f":"前年度登録!S11","v":0},null,"",{"$f":"IF(O14=\"\",\"\",HLOOKUP(O14,前年度登録!$AW$3:$CW$118,9,FALSE))","v":""},"","",null,"",null,"","",null,"",null,null,{"$f":"IF(AB14=\"\",\"\",IF(I14=1,VLOOKUP(AB14,#REF!,2,FALSE),IF(I14=2,VLOOKUP(AB14,#REF!,2,FALSE))))","v":""},null,null,null,null,null,null,null,"*","","A",null,{"$f":"COUNTIF($Y$7:$Y$116,\"女子A\")","v":0},0,null,null,null,0,null,0,"","","男子4×100mR",null,"女子4×100mR"]
[0,{"$f":"前年度登録!AE12","v":""},0,null,{"$f":"前年度登録!T12","v":0},{"$f":"前年度登録!DB12","v":""},{"$f":"前年度登録!AO12","v":""},{"$f":"前年度登録!DB12","v":""},{"$f":"前年度登録!AN12","v":""},{"$f":"前年度登録!DC12","v":""},{"$f":"前年度登録!DE12","v":0},{"$f":"前年度登録!DJ12","v":"00"},"三重",{"$f":"前年度登録!S12","v":0},null,"",{"$f":"IF(O15=\"\",\"\",HLOOKUP(O15,前年度登録!$AW$3:$CW$118,10,FALSE))","v":""},"","",null,"",null,"","",null,"",null,null,{"$f":"IF(AB15=\"\",\"\",IF(I15=1,VLOOKUP(AB15,#REF!,2,FALSE),IF(I15=2,VLOOKUP(AB15,#REF!,2,FALSE))))","v":""},null,null,null,null,null,null,null,"走幅跳","","B",null,{"$f":"COUNTIF($Y$7:$Y$116,\"女子B\")","v":0},0,null,null,null,0,null,0,"","","Ｂ",null,"Ｂ"]
{"$rows_left_out":103}
{"sheet":"所属コード","index":2,"n_rows":189,"n_cols":7,"rows_kept":189,"cut":false,"hidden":true,"merged":[]}
["所属名","所属NO","所属名","所属名略称","所属地NO"]
["成徳","235001","成徳","桑名市",100,null,"桑員"]
["明正","235002","明正","桑名市",100,null,"桑員"]
["光風","235003","光風","桑名市",100,null,"桑員"]
["陽和","235004","陽和","桑名市",100,null,"桑員"]
["正和","235005","正和","桑名市",100,null,"桑員"]
["陵成","235006","陵成","桑名市",100,null,"桑員"]
["光陵","235007","光陵","桑名市",100,null,"桑員"]
["多度","235008","多度","桑名市",100,null,"桑員"]
["長島","235009","長島","桑名市",100,null,"桑員"]
["津田学園","235010","津田学園","桑名市",100,null,"桑員"]
["木曽岬","235011","木曽岬","桑名郡",100,null,"桑員"]
["北勢","235012","北勢","いなべ市",100,null,"桑員"]
["員弁","235013","員弁","いなべ市",100,null,"桑員"]
["大安","235014","大安","いなべ市",100,null,"桑員"]
{"$rows_left_out":175}
{"sheet":"1","index":3,"n_rows":1,"n_cols":4,"rows_kept":1,"cut":false,"hidden":true,"merged":[]}
[1,"選　手","コード","コード"]